Target
Acetylcholine-binding protein
Ligand
BDBM50251868
Substrate
Meas. Tech.
ChEMBL_908842 (CHEMBL3067864)
Ki
220±n/a nM
Citation
 Tomizawa, MCasida, JE Unique neonicotinoid binding conformations conferring selective receptor interactions. J Agric Food Chem 59:2825-8 (2011)  
Target
Name:
Acetylcholine-binding protein
Synonyms:
ACHP_LYMST Acetylcholine Binding protein Acetylcholine-binding protein (Ls-AchBP) | AchBP
Type:
Mol. Mass.:
26055.52
Organism:
Lymnaea stagnalis
Description:
Soluble acetylcholine receptor
Residue:
229
  
Inhibitor
Name:
BDBM50251868
Synonyms:
(Z)-thiacloprid {(2Z)-3-[(6-chloropyridin-3-yl)methyl]-1,3-thiazolidin-2-ylidene}cyanamide
Type:
Small organic molecule
Emp. Form.:
C10H9ClN4S
Mol. Mass.:
252.723
SMILES:
Clc1ccc(CN2CCS\C2=N/C#N)cn1
: