Target
Alpha-1B adrenergic receptor
Ligand
BDBM50022722
Substrate
Meas. Tech.
ChEMBL_911062 (CHEMBL3056709)
EC50
281838±n/a nM
Citation
  TBA Med Chem Res 13:134-148 (2004)    Article 
Target
Name:
Alpha-1B adrenergic receptor
Synonyms:
ADA1B_RAT Alpha 1B-adrenoceptor Alpha adrenergic receptor 1A and 1B Alpha-1Adrenoceptor Alpha-1B adrenoreceptor | adrenergic Alpha1B
Type:
G Protein-Coupled Receptor (GPCR)
Mol. Mass.:
56606.71
Organism:
Rattus norvegicus (rat)
Description:
Receptor binding assays were performed using rat cortical membranes.
Residue:
515
  
Inhibitor
Name:
BDBM50022722
Synonyms:
(+)2-Amino-1-phenyl-propan-1-ol (1R, 2S)-2-Amino-1-phenyl-propan-1-ol (1S, 2S)-2-Amino-1-phenyl-propan-1-ol Biphetap Bromatapp Codamine Demazin Dimetapp Hycomine Norephedrine, (-) PHENYLPROPANOLAMINE Pseudonorephedrine, (-) [cathine, (-)] Triaminic-12
Type:
Small organic molecule
Emp. Form.:
C9H13NO
Mol. Mass.:
151.2056
SMILES:
CC(N)C(O)c1ccccc1
: