Target
Alpha-1D adrenergic receptor
Ligand
BDBM50118702
Substrate
Meas. Tech.
ChEMBL_911060 (CHEMBL3057221)
EC50
1862±n/a nM
Citation
  TBA Med Chem Res 13:134-148 (2004)    Article 
Target
Name:
Alpha-1D adrenergic receptor
Synonyms:
ADA1D_RAT Adra1d Alpha-1D adrenergic receptor | Serotonin 1a (5-HT1a) receptor/Adrenergic receptor alpha-1
Type:
Protein
Mol. Mass.:
59375.97
Organism:
Rattus norvegicus (Rat)
Description:
P23944
Residue:
561
  
Inhibitor
Name:
BDBM50118702
Synonyms:
2-Amino-1-(2,5-dimethoxy-phenyl)-ethanol DESGLYMIDODRINE Proamatine
Type:
Small organic molecule
Emp. Form.:
C10H15NO3
Mol. Mass.:
197.231
SMILES:
COc1ccc(OC)c(c1)C(O)CN
: