Target
Acetylcholinesterase
Ligand
BDBM81461
Substrate
Meas. Tech.
ChEMBL_909636 (CHEMBL3053712)
Ki
7000±n/a nM
Citation
  TBA Med Chem Res 14:297-308 (2005)    Article 
Target
Name:
Acetylcholinesterase
Synonyms:
ACES_ELEEL Acetylcholinesterase (EeAChE) | ache
Type:
Enzyme
Mol. Mass.:
71812.79
Organism:
Electrophorus electricus (Electric eel)
Description:
Residue:
633
  
Inhibitor
Name:
BDBM81461
Synonyms:
CAS_86-54-4 Hydralazine (HZN) | NSC_3637
Type:
Small organic molecule
Emp. Form.:
C8H8N4
Mol. Mass.:
160.1759
SMILES:
NNc1nncc2ccccc12
: