Target
Retinoic acid receptor gamma
Ligand
BDBM50031459
Substrate
Meas. Tech.
ChEMBL_196164 (CHEMBL804937)
IC50
>1000±n/a nM
Citation
 Alam, MZhestkov, VSani, BPVenepally, PLevin, AAKazmer, SLi, ENorris, AWZhang, XKLee, MO Conformationally defined 6-s-trans-retinoic acid analogs. 2. Selective agonists for nuclear receptor binding and transcriptional activity. J Med Chem 38:2302-10 (1995)  
Target
Name:
Retinoic acid receptor gamma
Synonyms:
Nr1b3 Rarg
Type:
PROTEIN
Mol. Mass.:
50896.02
Organism:
Mus musculus
Description:
ChEMBL_196161
Residue:
458
  
Inhibitor
Name:
BDBM50031459
Synonyms:
(2Z,4E6E,8E)-3,7-dimethyl-9-(2,6,6-trimethylcyclohex-1-en-1-yl)nona-2,4,6,8-tetraenoic acid 13-RA 13-cis-retinoic acid Neovitamin A acid | isotretinoin
Type:
Small organic molecule
Emp. Form.:
C20H28O2
Mol. Mass.:
300.4351
SMILES:
C\C(\C=C\C1=C(C)CCCC1(C)C)=C/C=C/C(/C)=C\C(O)=O
: