Target
Potassium-transporting ATPase alpha chain 1/subunit beta
Ligand
BDBM50032152
Substrate
Meas. Tech.
ChEMBL_76069 (CHEMBL688290)
IC50
36±n/a nM
Citation
 Ife, RJBrown, THBlurton, PKeeling, DJLeach, CAMeeson, MLParsons, METheobald, CJ Reversible inhibitors of the gastric (H+/K+)-ATPase. 5. Substituted 2,4-diaminoquinazolines and thienopyrimidines. J Med Chem 38:2763-73 (1995)  
Target
Name:
Potassium-transporting ATPase alpha chain 1/subunit beta
Synonyms:
Potassium-transporting ATPase | Potassium-transporting ATPase alpha chain 1/beta chain
Type:
Mol. Mass.:
Description:
Components:
This complex has 0 components.
Component 1
Name:
Potassium-transporting ATPase subunit beta
Synonyms:
ATP4B Gastric H(+)/K(+) ATPase subunit beta Potassium-transporting ATPase beta chain Proton pump beta chain | gp60-90
Type:
Mol. Mass.:
33083.09
Organism:
Sus scrofa (Pig)
Description:
Residue:
290
  
Component 2
Name:
Potassium-transporting ATPase alpha chain 1
Synonyms:
ATP4A Gastric H(+)/K(+) ATPase subunit alpha Na/K-ATPase Potassium-transporting ATPase alpha chain 1 | Proton pump
Type:
Enzyme
Mol. Mass.:
114279.23
Organism:
Sus scrofa (Pig)
Description:
P19156
Residue:
1034
  
Inhibitor
Name:
BDBM50032152
Synonyms:
8-(3-Dimethylamino-propoxy)-N*2*-(4-fluoro-2-methyl-phenyl)-N*4*-methyl-N*4*-phenyl-quinazoline-2,4-diamine | CHEMBL93756
Type:
Small organic molecule
Emp. Form.:
C27H30FN5O
Mol. Mass.:
459.5584
SMILES:
CN(C)CCCOc1cccc2c(nc(Nc3ccc(F)cc3C)nc12)N(C)c1ccccc1
: