Target
Retinoic acid receptor beta
Ligand
BDBM50032220
Substrate
Meas. Tech.
ChEMBL_195475 (CHEMBL798152)
EC50
23±n/a nM
Citation
 Beard, RLChandraratna, RAColon, DFGillett, SJHenry, EMarler, DKSong, TDenys, LGarst, MEArefieg, T Synthesis and structure-activity relationships of stilbene retinoid analogs substituted with heteroaromatic carboxylic acids. J Med Chem 38:2820-9 (1995)  
Target
Name:
Retinoic acid receptor beta
Synonyms:
HAP NR1B2 RAR-beta RARB Retinoic acid receptor RXR-alpha/Retinoic acid receptor beta Retinoid receptor
Type:
PROTEIN
Mol. Mass.:
50498.70
Organism:
Homo sapiens (Human)
Description:
ChEMBL_1458015
Residue:
455
  
Inhibitor
Name:
BDBM50032220
Synonyms:
5-[(E)-2-(3,5,5,8,8-Pentamethyl-5,6,7,8-tetrahydro-naphthalen-2-yl)-propenyl]-thiophene-2-carboxylic acid | CHEMBL91718
Type:
Small organic molecule
Emp. Form.:
C23H28O2S
Mol. Mass.:
368.532
SMILES:
C\C(=C/c1ccc(s1)C(O)=O)c1cc2c(cc1C)C(C)(C)CCC2(C)C
: