Target
Adenosine kinase
Ligand
BDBM50413749
Substrate
Meas. Tech.
ChEMBL_912301 (CHEMBL3063318)
Ki
37700±n/a nM
Citation
  TBA Med Chem Res 21:590-600 (2012)    Article 
Target
Name:
Adenosine kinase
Synonyms:
ADK_TOXGO | AK
Type:
PROTEIN
Mol. Mass.:
38353.04
Organism:
Toxoplasma gondii
Description:
ChEMBL_629062
Residue:
363
  
Inhibitor
Name:
BDBM50413749
Synonyms:
CHEMBL59683
Type:
Small organic molecule
Emp. Form.:
C17H16ClFN4O4S
Mol. Mass.:
426.85
SMILES:
OC[C@H]1O[C@H]([C@H](O)[C@@H]1O)n1cnc2c(SCc3c(F)cccc3Cl)ncnc12
: