Target
Adenosine kinase
Ligand
BDBM50413742
Substrate
Meas. Tech.
ChEMBL_912301 (CHEMBL3063318)
Ki
2900±n/a nM
Citation
  TBA Med Chem Res 21:590-600 (2012)    Article 
Target
Name:
Adenosine kinase
Synonyms:
ADK_TOXGO | AK
Type:
PROTEIN
Mol. Mass.:
38353.04
Organism:
Toxoplasma gondii
Description:
ChEMBL_629062
Residue:
363
  
Inhibitor
Name:
BDBM50413742
Synonyms:
CHEMBL59195
Type:
Small organic molecule
Emp. Form.:
C18H17F3N4O4S
Mol. Mass.:
442.412
SMILES:
OC[C@H]1O[C@H]([C@H](O)[C@@H]1O)n1cnc2c(SCc3cccc(c3)C(F)(F)F)ncnc12
: