Target
Cytochrome P450 71B1
Ligand
BDBM50281349
Substrate
Meas. Tech.
ChEMBL_921512 (CHEMBL3083269)
IC50
12000±n/a nM
Citation
 Lamb, DCKelly, DEHanley, SZMehmood, ZKelly, SL Glyphosate is an inhibitor of plant cytochrome P450: functional expression of Thlaspi arvensae cytochrome P45071B1/reductase fusion protein in Escherichia coli. Biochem Biophys Res Commun 244:110-4 (1998)  
Target
Name:
Cytochrome P450 71B1
Synonyms:
1.14.-.- CYP71B1 Cytochrome P450 71B1
Type:
PROTEIN
Mol. Mass.:
56394.77
Organism:
Thlaspi arvense
Description:
ChEMBL_105549
Residue:
496
  
Inhibitor
Name:
BDBM50281349
Synonyms:
CHEMBL95764 glyphosate
Type:
Small organic molecule
Emp. Form.:
C3H8NO5P
Mol. Mass.:
169.0731
SMILES:
OC(=O)CNCP(O)(O)=O
: