Target
3-oxo-5-alpha-steroid 4-dehydrogenase 2
Ligand
BDBM50488110
Substrate
Meas. Tech.
ChEMBL_922089 (CHEMBL3078155)
IC50
0.090000±n/a nM
Citation
  TBA Med Chem Res 22:105-114 (2013)    Article 
Target
Name:
3-oxo-5-alpha-steroid 4-dehydrogenase 2
Synonyms:
3-oxo-5-alpha-steroid 4-dehydrogenase 2 5α-Reductase 2 (5α-R2) SR type 2 Steroid 5-alpha-reductase Type II 5-alpha reductase
Type:
Enzyme
Mol. Mass.:
28406.59
Organism:
Homo sapiens (Human)
Description:
P31213
Residue:
254
  
Inhibitor
Name:
BDBM50488110
Synonyms:
CHEMBL2282776
Type:
Small organic molecule
Emp. Form.:
C32H38N2O2
Mol. Mass.:
482.6563
SMILES:
C[C@]12CC[C@H]3[C@@H](CNC4=CC(=O)CC[C@]34C)[C@@H]1CC[C@@H]2C(=O)NC(c1ccccc1)c1ccccc1
: