Target
Retinoic acid receptor RXR-beta
Ligand
BDBM50033071
Substrate
Meas. Tech.
ChEMBL_197075 (CHEMBL806663)
EC50
180±n/a nM
Citation
 Dawson, MIJong, LHobbs, PDCameron, JFChao, WRPfahl, MLee, MOShroot, BPfahl, M Conformational effects on retinoid receptor selectivity. 2. Effects of retinoid bridging group on retinoid X receptor activity and selectivity. J Med Chem 38:3368-83 (1995)  
Target
Name:
Retinoic acid receptor RXR-beta
Synonyms:
NR2B2 RXRB Retinoic acid receptor RXR-beta Retinoid receptor
Type:
PROTEIN
Mol. Mass.:
56932.89
Organism:
Homo sapiens (Human)
Description:
ChEMBL_39045
Residue:
533
  
Inhibitor
Name:
BDBM50033071
Synonyms:
4-[2-(5,5,8,8-Tetramethyl-5,6,7,8-tetrahydro-naphthalen-2-yl)-[1,3]oxathiolan-2-yl]-benzoic acid | CHEMBL113975
Type:
Small organic molecule
Emp. Form.:
C24H28O3S
Mol. Mass.:
396.542
SMILES:
CC1(C)CCC(C)(C)c2cc(ccc12)C1(OCCS1)c1ccc(cc1)C(O)=O
: