Target
Retinoic acid receptor RXR-alpha
Ligand
BDBM50033072
Substrate
Meas. Tech.
ChEMBL_196906 (CHEMBL807368)
EC50
2900±n/a nM
Citation
 Dawson, MIJong, LHobbs, PDCameron, JFChao, WRPfahl, MLee, MOShroot, BPfahl, M Conformational effects on retinoid receptor selectivity. 2. Effects of retinoid bridging group on retinoid X receptor activity and selectivity. J Med Chem 38:3368-83 (1995)  
Target
Name:
Retinoic acid receptor RXR-alpha
Synonyms:
NR2B1 Nuclear receptor subfamily 4 group A member 2 RXRA Retinoic acid receptor RXR-alpha/gamma Retinoid receptor
Type:
PROTEIN
Mol. Mass.:
50820.38
Organism:
Homo sapiens (Human)
Description:
ChEMBL_1456363
Residue:
462
  
Inhibitor
Name:
BDBM50033072
Synonyms:
4-[Hydroxy-(5,5,8,8-tetramethyl-5,6,7,8-tetrahydro-naphthalen-2-yl)-methyl]-benzoic acid | CHEMBL115558
Type:
Small organic molecule
Emp. Form.:
C22H26O3
Mol. Mass.:
338.44
SMILES:
CC1(C)CCC(C)(C)c2cc(ccc12)C(O)c1ccc(cc1)C(O)=O
: