Target
Retinoic acid receptor RXR-alpha
Ligand
BDBM50033080
Substrate
Meas. Tech.
ChEMBL_196906 (CHEMBL807368)
EC50
86±n/a nM
Citation
 Dawson, MIJong, LHobbs, PDCameron, JFChao, WRPfahl, MLee, MOShroot, BPfahl, M Conformational effects on retinoid receptor selectivity. 2. Effects of retinoid bridging group on retinoid X receptor activity and selectivity. J Med Chem 38:3368-83 (1995)  
Target
Name:
Retinoic acid receptor RXR-alpha
Synonyms:
NR2B1 Nuclear receptor subfamily 4 group A member 2 RXRA Retinoic acid receptor RXR-alpha/gamma Retinoid receptor
Type:
PROTEIN
Mol. Mass.:
50820.38
Organism:
Homo sapiens (Human)
Description:
ChEMBL_1456363
Residue:
462
  
Inhibitor
Name:
BDBM50033080
Synonyms:
4-[2-Methyl-1-(5,5,8,8-tetramethyl-5,6,7,8-tetrahydro-naphthalen-2-yl)-propenyl]-benzoic acid | CHEMBL24966
Type:
Small organic molecule
Emp. Form.:
C25H30O2
Mol. Mass.:
362.5045
SMILES:
[#6]\[#6](-[#6])=[#6](\c1ccc(cc1)-[#6](-[#8])=O)-c1ccc2c(c1)C([#6])([#6])[#6]-[#6]C2([#6])[#6]
: