Target
Pancreatic alpha-amylase
Ligand
BDBM50033631
Substrate
Meas. Tech.
ChEMBL_35666 (CHEMBL649516)
IC50
0.300000±n/a nM
Citation
 Amblard, MRodriguez, MLignon, MFGalas, MCBernad, NArtis-Noël, AMHauad, LLaur, JCalifano, JCAumelas, A Synthesis and biological evaluation of cholecystokinin analogs in which the Asp-Phe-NH2 moiety has been replaced by a 3-amino-7-phenylheptanoic acid or a 3-amino-6-(phenyloxy)hexanoic acid. J Med Chem 36:3021-8 (1993)  
Target
Name:
Pancreatic alpha-amylase
Synonyms:
1,4-alpha-D-glucan glucanohydrolase AMYP_HUMAN Pancreatic α-amylase (HPA) Pancreatic alpha-amylase (HPA)
Type:
Protein
Mol. Mass.:
57709.71
Organism:
Homo sapiens (Human)
Description:
Residue:
511
  
Inhibitor
Name:
BDBM50033631
Synonyms:
2-{2-[2-(2-{2-[2-tert-Butoxycarbonylamino-3-(4-sulfo-phenyl)-propionylamino]-4-methylsulfanyl-butyrylamino}-acetylamino)-3-(1H-indol-3-yl)-propionylamino]-hexanoylamino}-succinic acid 1-phenethyl ester | CHEMBL386811
Type:
Small organic molecule
Emp. Form.:
C50H65N7O14S2
Mol. Mass.:
1052.22
SMILES:
CCCC[C@H](NC(=O)[C@@H](Cc1c[nH]c2ccccc12)NC(=O)CNC(=O)[C@H](CCSC)NC(=O)[C@H](Cc1ccc(cc1)S(O)(=O)=O)NC(=O)OC(C)(C)C)C(=O)N[C@@H](CC(O)=O)C(=O)OCCc1ccccc1
: