Target
Acetylcholinesterase
Ligand
BDBM50248637
Substrate
Meas. Tech.
ChEMBL_931328 (CHEMBL3069985)
IC50
415±n/a nM
Citation
  TBA Med Chem Res 22:2328-2345 (2013)    Article 
Target
Name:
Acetylcholinesterase
Synonyms:
ACES_RAT Acetylcholinesterase and butyrylcholinesterase (AChE and BChE) Acetylcholinesterase, AChE | Ache
Type:
Enzyme
Mol. Mass.:
68193.62
Organism:
Rattus norvegicus (rat)
Description:
P37136
Residue:
614
  
Inhibitor
Name:
BDBM50248637
Synonyms:
(E)-2-{4-[(Dimethylamino)methyl]benzylidene}-5,6-dimethoxy-2,3-dihydroinden-1-one | CHEMBL462873
Type:
Small organic molecule
Emp. Form.:
C21H23NO3
Mol. Mass.:
337.4122
SMILES:
COc1cc2C\C(=C/c3ccc(CN(C)C)cc3)C(=O)c2cc1OC
: