Target
Acetylcholinesterase
Ligand
BDBM50169860
Substrate
Meas. Tech.
ChEMBL_931328 (CHEMBL3069985)
IC50
150±n/a nM
Citation
  TBA Med Chem Res 22:2328-2345 (2013)    Article 
Target
Name:
Acetylcholinesterase
Synonyms:
ACES_RAT Acetylcholinesterase and butyrylcholinesterase (AChE and BChE) Acetylcholinesterase, AChE | Ache
Type:
Enzyme
Mol. Mass.:
68193.62
Organism:
Rattus norvegicus (rat)
Description:
P37136
Residue:
614
  
Inhibitor
Name:
BDBM50169860
Synonyms:
2-[4-(1-Dimethylamino-ethyl)-phenoxy]-5,6-dimethoxy-indan-1-one | CHEMBL178152
Type:
Small organic molecule
Emp. Form.:
C21H25NO4
Mol. Mass.:
355.4275
SMILES:
COc1cc2CC(Oc3ccc(cc3)C(C)N(C)C)C(=O)c2cc1OC
: