Target
Sodium channel protein type 2 subunit alpha
Ligand
BDBM50488718
Substrate
Meas. Tech.
ChEMBL_932071 (CHEMBL3073853)
Ki
18270±n/a nM
Citation
  TBA Med Chem Res 22:3177-3184 (2013)    Article 
Target
Name:
Sodium channel protein type 2 subunit alpha
Synonyms:
HBSC II SCN2A SCN2A2 Sodium (Site 2) Sodium channel protein type 2 alpha subunit Voltage-gated sodium channel subunit alpha Nav1.2
Type:
Enzyme
Mol. Mass.:
227954.68
Organism:
Homo sapiens (Human)
Description:
Q99250
Residue:
2005
  
Inhibitor
Name:
BDBM50488718
Synonyms:
CHEMBL2298874
Type:
Small organic molecule
Emp. Form.:
C16H12N2O3
Mol. Mass.:
280.2781
SMILES:
CC(=O)Nc1ccc(cc1)N1C(=O)c2ccccc2C1=O
: