Target
Sodium channel protein type 2 subunit alpha
Ligand
BDBM152638
Substrate
Meas. Tech.
ChEMBL_932071 (CHEMBL3073853)
Ki
16010±n/a nM
Citation
  TBA Med Chem Res 22:3177-3184 (2013)    Article 
Target
Name:
Sodium channel protein type 2 subunit alpha
Synonyms:
HBSC II SCN2A SCN2A2 Sodium (Site 2) Sodium channel protein type 2 alpha subunit Voltage-gated sodium channel subunit alpha Nav1.2
Type:
Enzyme
Mol. Mass.:
227954.68
Organism:
Homo sapiens (Human)
Description:
Q99250
Residue:
2005
  
Inhibitor
Name:
BDBM152638
Synonyms:
4-(1,3-Dioxoisoindolin-2-yl)benzenesulphonamide (1) | BDBM50222606
Type:
Small organic molecule
Emp. Form.:
C14H10N2O4S
Mol. Mass.:
302.305
SMILES:
NS(=O)(=O)c1ccc(cc1)N1C(=O)c2ccccc2C1=O
: