Target
Sodium channel protein type 2 subunit alpha
Ligand
BDBM45791
Substrate
Meas. Tech.
ChEMBL_932071 (CHEMBL3073853)
Ki
50400±n/a nM
Citation
  TBA Med Chem Res 22:3177-3184 (2013)    Article 
Target
Name:
Sodium channel protein type 2 subunit alpha
Synonyms:
HBSC II SCN2A SCN2A2 Sodium (Site 2) Sodium channel protein type 2 alpha subunit Voltage-gated sodium channel subunit alpha Nav1.2
Type:
Enzyme
Mol. Mass.:
227954.68
Organism:
Homo sapiens (Human)
Description:
Q99250
Residue:
2005
  
Inhibitor
Name:
BDBM45791
Synonyms:
4-(1,3-dioxo-2-isoindolyl)benzoic acid 4-[1,3-bis(oxidanylidene)isoindol-2-yl]benzoic acid MLS-0091937.0001 | cid_246499
Type:
Small organic molecule
Emp. Form.:
C15H9NO4
Mol. Mass.:
267.2363
SMILES:
OC(=O)c1ccc(cc1)N1C(=O)c2ccccc2C1=O
: