Target
Peroxisome proliferator-activated receptor alpha
Ligand
BDBM50242349
Substrate
Meas. Tech.
ChEMBL_933251 (CHEMBL3069175)
IC50
1100±n/a nM
Citation
  TBA Med Chem Res 22:3126-3133 (2013)    Article 
Target
Name:
Peroxisome proliferator-activated receptor alpha
Synonyms:
NR1C1 PPAR PPAR-alpha PPARA_HUMAN Peroxisome proliferator-activated receptor | Peroxisome proliferator-activated receptor alpha (PPAR alpha)
Type:
Enzyme
Mol. Mass.:
52222.08
Organism:
Homo sapiens (Human)
Description:
Q07869
Residue:
468
  
Inhibitor
Name:
BDBM50242349
Synonyms:
(5Z,8Z,11Z,14Z,17Z)-5,8,11,14,17-eicosapentaenoic acid (all-Z)-5,8,11,14,17-eicosapentaenoic acid 5Z,8Z,11Z,14Z,17Z-eicosapentaenoic acid EPA Icosapent all-cis-icosa-5,8,11,14,17-pentaenoic acid cis-Delta(5,8,11,14,17)-eicosapentaenoic acid vascepa
Type:
Small organic molecule
Emp. Form.:
C20H30O2
Mol. Mass.:
302.451
SMILES:
CC\C=C/C\C=C/C\C=C/C\C=C/C\C=C/CCCC(O)=O
: