Target
Peroxisome proliferator-activated receptor delta
Ligand
BDBM50240347
Substrate
Meas. Tech.
ChEMBL_933249 (CHEMBL3069173)
IC50
16000±n/a nM
Citation
  TBA Med Chem Res 22:3126-3133 (2013)    Article 
Target
Name:
Peroxisome proliferator-activated receptor delta
Synonyms:
NR1C2 NUCI Nuclear receptor subfamily 1 group C member 2 PPAR-beta PPARD Peroxisome proliferator-activated receptor Peroxisome proliferator-activated receptor delta
Type:
Enzyme
Mol. Mass.:
49910.45
Organism:
Homo sapiens (Human)
Description:
Q03181
Residue:
441
  
Inhibitor
Name:
BDBM50240347
Synonyms:
(9,12,15)-linolenic acid (Z,Z,Z)-9,12,15-octadecatrienoic acid ALA all-cis-9,12,15-octadecatrienoic acid cid_5280934 cis-Delta(9,12,15)-octadecatrienoic acid | linolenic acid
Type:
Small organic molecule
Emp. Form.:
C18H30O2
Mol. Mass.:
278.4296
SMILES:
CC\C=C/C\C=C/C\C=C/CCCCCCCC(O)=O
: