Target
5-hydroxytryptamine receptor 1A
Ligand
BDBM50034286
Substrate
Meas. Tech.
ChEMBL_1174 (CHEMBL615940)
Ki
1.88±n/a nM
Citation
 Orjales, AAlonso-Cires, LLabeaga, LCorcóstegui, R New (2-methoxyphenyl)piperazine derivatives as 5-HT1A receptor ligands with reduced alpha 1-adrenergic activity. Synthesis and structure-affinity relationships. J Med Chem 38:1273-7 (1995)  
Target
Name:
5-hydroxytryptamine receptor 1A
Synonyms:
5-HT-1A 5-HT1A 5-hydroxytryptamine receptor 1A (5HT1A) 5ht1a Htr1a Serotonin 1a (5-HT1a) receptor/Adrenergic receptor alpha-1 | Serotonin receptor 1A
Type:
G Protein-Coupled Receptor (GPCR)
Mol. Mass.:
46445.29
Organism:
Rattus norvegicus (rat)
Description:
Binding assays were performed using rat hippocampal membranes.
Residue:
422
  
Inhibitor
Name:
BDBM50034286
Synonyms:
CHEMBL23904 | Cyclopentanecarboxylic acid {4-[4-(2-methoxy-phenyl)-piperazin-1-yl]-butyl}-amide
Type:
Small organic molecule
Emp. Form.:
C21H33N3O2
Mol. Mass.:
359.5056
SMILES:
COc1ccccc1N1CCN(CCCCNC(=O)C2CCCC2)CC1
: