Target
Seed linoleate 13S-lipoxygenase-1
Ligand
BDBM192766
Substrate
Meas. Tech.
ChEMBL_930119 (CHEMBL3068968)
Ki
204±n/a nM
Citation
  TBA Med Chem Res 22:5036-5043 (2013)    Article 
Target
Name:
Seed linoleate 13S-lipoxygenase-1
Synonyms:
15-LOX 15-lipo-oxygenase (SLO) L-1 LOX1.1 Lipoxygenase (LOX) Lipoxygenase-1 | Seed lipoxygenase-1
Type:
Enzyme
Mol. Mass.:
94365.66
Organism:
Glycine max (soybean)
Description:
Residue:
839
  
Inhibitor
Name:
BDBM192766
Synonyms:
4-MMPB
Type:
Small organic molecule
Emp. Form.:
C16H19N5S
Mol. Mass.:
313.421
SMILES:
CN1CCN(CC1)c1nc(C)c2Nc3ccccc3Sc2n1
: