Target
Gag-Pol polyprotein [489-587]
Ligand
BDBM383
Substrate
Meas. Tech.
ChEMBL_158031 (CHEMBL768622)
IC50
0.06±n/a nM
Citation
 Holloway, MKWai, JMHalgren, TAFitzgerald, PMVacca, JPDorsey, BDLevin, RBThompson, WJChen, LJdeSolms, SJ A priori prediction of activity for HIV-1 protease inhibitors employing energy minimization in the active site. J Med Chem 38:305-17 (1995)  
Target
Name:
Gag-Pol polyprotein [489-587]
Synonyms:
Human immunodeficiency virus type 1 protease Pol polyprotein | gag-pol
Type:
Enzyme Subunit
Mol. Mass.:
10781.16
Organism:
Human immunodeficiency virus type 1
Description:
P04585[489-587]
Residue:
99
  
Inhibitor
Name:
BDBM383
Synonyms:
(3S)-oxolan-3-yl N-[(2S,3S,5R)-5-benzyl-3-hydroxy-5-{[(1S,2R)-2-hydroxy-2,3-dihydro-1H-inden-1-yl]carbamoyl}-1-phenylpentan-2-yl]carbamate | Urethane deriv. 2
Type:
Small organic molecule
Emp. Form.:
C33H38N2O6
Mol. Mass.:
558.6646
SMILES:
O[C@@H](C[C@@H](Cc1ccccc1)C(=O)N[C@@H]1[C@H](O)Cc2ccccc12)[C@H](Cc1ccccc1)NC(=O)O[C@H]1CCOC1
: