Target
Adenosine receptor A2a
Ligand
BDBM50491455
Substrate
Meas. Tech.
ChEMBL_958098 (CHEMBL2384072)
IC50
4365±n/a nM
Citation
 Jörg, MShonberg, JMak, FSMiller, NDYuriev, EScammells, PJCapuano, B Novel adenosine A(2A) receptor ligands: a synthetic, functional and computational investigation of selected literature adenosine A(2A) receptor antagonists for extending into extracellular space. Bioorg Med Chem Lett 23:3427-33 (2013)  
Target
Name:
Adenosine receptor A2a
Synonyms:
A2A adenosine receptor (hA2A) ADENOSINE A2 ADORA2 Adenosine A2A receptor (A2AAR)
Type:
G Protein-Coupled Receptor (GPCR)
Mol. Mass.:
44716.46
Organism:
Homo sapiens (Human)
Description:
P29274
Residue:
412
  
Inhibitor
Name:
BDBM50491455
Synonyms:
CHEMBL2381767
Type:
Small organic molecule
Emp. Form.:
C25H32N4O6
Mol. Mass.:
484.5448
SMILES:
CCOC(=O)CCCOc1ccc(\C=C\c2nc3n(CC)c(=O)n(CC)c(=O)c3n2C)cc1OC
: