Target
Adenosine receptor A2a
Ligand
BDBM50176058
Substrate
Meas. Tech.
ChEMBL_958099 (CHEMBL2384073)
Ki
6.6±n/a nM
Citation
 Jörg, MShonberg, JMak, FSMiller, NDYuriev, EScammells, PJCapuano, B Novel adenosine A(2A) receptor ligands: a synthetic, functional and computational investigation of selected literature adenosine A(2A) receptor antagonists for extending into extracellular space. Bioorg Med Chem Lett 23:3427-33 (2013)  
Target
Name:
Adenosine receptor A2a
Synonyms:
A2A adenosine receptor (hA2A) ADENOSINE A2 ADORA2 Adenosine A2A receptor (A2AAR)
Type:
G Protein-Coupled Receptor (GPCR)
Mol. Mass.:
44716.46
Organism:
Homo sapiens (Human)
Description:
P29274
Residue:
412
  
Inhibitor
Name:
BDBM50176058
Synonyms:
2-Butyl-9-methyl-8-[1,2,3]triazol-2-yl-9H-purin-6-ylamine CHEMBL197669 | ST-1535
Type:
Small organic molecule
Emp. Form.:
C12H16N8
Mol. Mass.:
272.309
SMILES:
CCCCc1nc(N)c2nc(-n3nccn3)n(C)c2n1
: