Target
Neutrophil elastase
Ligand
BDBM50036095
Substrate
Meas. Tech.
ChEMBL_63977 (CHEMBL677603)
Ki
0.21±n/a nM
Citation
 Veale, CABernstein, PRBryant, CCeccarelli, CDamewood, JREarley, RFeeney, SWGomes, BKosmider, BJSteelman, GB Nonpeptidic inhibitors of human leukocyte elastase. 5. Design, synthesis, and X-ray crystallography of a series of orally active 5-aminopyrimidin-6-one-containing trifluoromethyl ketones. J Med Chem 38:98-108 (1995)  
Target
Name:
Neutrophil elastase
Synonyms:
Bone marrow serine protease Coagulation factor X ELANE Elastase HLE Leukocyte elastase Medullasin Neutrophil elastase (HNE) PMN elastase Trypsin
Type:
Enzyme
Mol. Mass.:
28532.38
Organism:
Homo sapiens (Human)
Description:
P08246
Residue:
267
  
Inhibitor
Name:
BDBM50036095
Synonyms:
2-[5-Cyclohexanesulfonylamino-2-(4-fluoro-phenyl)-6-oxo-6H-pyrimidin-1-yl]-N-[2-methyl-1-(4,4,5,5-tetramethyl-[1,3,2]dioxaborolan-2-yl)-propyl]-acetamide | CHEMBL11099
Type:
Small organic molecule
Emp. Form.:
C28H40BFN4O6S
Mol. Mass.:
590.515
SMILES:
CC(C)C(NC(=O)Cn1c(ncc(NS(=O)(=O)C2CCCCC2)c1=O)-c1ccc(F)cc1)B1OC(C)(C)C(C)(C)O1
: