Target
Mu-type opioid receptor
Ligand
BDBM214798
Substrate
Meas. Tech.
ChEMBL_960779 (CHEMBL2387948)
IC50
1.2±n/a nM
Citation
 Petrov, RRLee, YSVardanyan, RSLiu, LMa, SWDavis, PLai, JPorreca, FVanderah, TWHruby, VJ Effect of anchoring 4-anilidopiperidines to opioid peptides. Bioorg Med Chem Lett 23:3434-7 (2013)  
Target
Name:
Mu-type opioid receptor
Synonyms:
M-OR-1 Mu opioid receptor OPIATE Mu OPRM_CAVPO
Type:
Enzyme Catalytic Domain
Mol. Mass.:
11165.58
Organism:
GUINEA PIG
Description:
P97266
Residue:
98
  
Inhibitor
Name:
BDBM214798
Synonyms:
Dynorphin A (1-17) | YGGFLRRIRPKLK
Type:
Small organic molecule
Emp. Form.:
C75H126N24O15
Mol. Mass.:
1603.9547
SMILES:
CC[C@H](C)[C@H](NC(=O)[C@H](CCCNC(N)=N)NC(=O)[C@H](CCCNC(N)=N)NC(=O)[C@H](CC(C)C)NC(=O)[C@H](Cc1ccccc1)NC(=O)CNC(=O)CNC(=O)[C@@H](N)Cc1ccc(O)cc1)C(=O)N[C@@H](CCCNC(N)=N)C(=O)N1CCC[C@H]1C(=O)N[C@@H](CCCCN)C(=O)N[C@@H](CC(C)C)C(=O)N[C@@H](CCCCN)C(O)=O
: