Target
Mu-type opioid receptor
Ligand
BDBM50008984
Substrate
Meas. Tech.
ChEMBL_960777 (CHEMBL2387946)
IC50
3.4±n/a nM
Citation
 Petrov, RRLee, YSVardanyan, RSLiu, LMa, SWDavis, PLai, JPorreca, FVanderah, TWHruby, VJ Effect of anchoring 4-anilidopiperidines to opioid peptides. Bioorg Med Chem Lett 23:3434-7 (2013)  
Target
Name:
Mu-type opioid receptor
Synonyms:
M-OR-1 Mu opioid receptor OPIATE Mu OPRM_CAVPO
Type:
Enzyme Catalytic Domain
Mol. Mass.:
11165.58
Organism:
GUINEA PIG
Description:
P97266
Residue:
98
  
Inhibitor
Name:
BDBM50008984
Synonyms:
4-(4-Chloro-benzyl)-2-(1-methyl-azepan-4-yl)-2H-phthalazin-1-one Duragesic-100 Duragesic-25 Duragesic-75 FENTANYL CITRATE Fentanyl-100 Fentanyl-25 Fentanyl-75 Innovar N-(1-Phenethyl-piperidin-4-yl)-N-phenyl-propionamide N-(1-phenethylpiperidin-4-yl)-N-phenylpropionamide | US20230399418, Compound Fentanyl
Type:
Small organic molecule
Emp. Form.:
C22H28N2O
Mol. Mass.:
336.4705
SMILES:
CCC(=O)N(C1CCN(CCc2ccccc2)CC1)c1ccccc1
: