Target
Mu-type opioid receptor
Ligand
BDBM214798
Substrate
Meas. Tech.
ChEMBL_960776 (CHEMBL2387945)
Ki
4.0±n/a nM
Citation
 Petrov, RRLee, YSVardanyan, RSLiu, LMa, SWDavis, PLai, JPorreca, FVanderah, TWHruby, VJ Effect of anchoring 4-anilidopiperidines to opioid peptides. Bioorg Med Chem Lett 23:3434-7 (2013)  
Target
Name:
Mu-type opioid receptor
Synonyms:
MOR-1 Mu-type opioid receptor (MOR) OPRM_RAT Opioid receptor B Ror-b
Type:
G Protein-Coupled Receptor (GPCR)
Mol. Mass.:
44503.11
Organism:
Rattus norvegicus (rat)
Description:
Competition binding assays were carried out using membrane preparations from transfected HN9.10 cells that constitutively expressed the mu opioid receptor.
Residue:
398
  
Inhibitor
Name:
BDBM214798
Synonyms:
Dynorphin A (1-17) | YGGFLRRIRPKLK
Type:
Small organic molecule
Emp. Form.:
C75H126N24O15
Mol. Mass.:
1603.9547
SMILES:
CC[C@H](C)[C@H](NC(=O)[C@H](CCCNC(N)=N)NC(=O)[C@H](CCCNC(N)=N)NC(=O)[C@H](CC(C)C)NC(=O)[C@H](Cc1ccccc1)NC(=O)CNC(=O)CNC(=O)[C@@H](N)Cc1ccc(O)cc1)C(=O)N[C@@H](CCCNC(N)=N)C(=O)N1CCC[C@H]1C(=O)N[C@@H](CCCCN)C(=O)N[C@@H](CC(C)C)C(=O)N[C@@H](CCCCN)C(O)=O
: