Target
5-hydroxytryptamine receptor 2A
Ligand
BDBM50492229
Substrate
Meas. Tech.
ChEMBL_968356 (CHEMBL2400227)
EC50
22±n/a nM
Citation
 Zhao, GKwon, CBisaha, SNStein, PDRossi, KACao, XUng, TWu, GHung, CPMalmstrom, SEZhang, GQu, QGan, JKeim, WJCullen, MJRohrbach, KWDevenny, JPelleymounter, MAMiller, KJRobl, JA Synthesis and SAR of potent and selective tetrahydropyrazinoisoquinolinone 5-HT(2C) receptor agonists. Bioorg Med Chem Lett 23:3914-9 (2013)  
Target
Name:
5-hydroxytryptamine receptor 2A
Synonyms:
5-HT-2 5-HT2A 5-hydroxytryptamine receptor 2A (5HT-2A) 5HT2A_HUMAN HTR2A | Serotonin receptor 2A
Type:
undefined
Mol. Mass.:
52607.65
Organism:
Homo sapiens (Human)
Description:
P28223
Residue:
471
  
Inhibitor
Name:
BDBM50492229
Synonyms:
CHEMBL2397890
Type:
Small organic molecule
Emp. Form.:
C14H18N2O
Mol. Mass.:
230.3055
SMILES:
[H][C@@]12CNCCN1C(=O)c1c(CC)cccc1C2
: