Target
Potassium voltage-gated channel subfamily H member 2
Ligand
BDBM50366822
Substrate
Meas. Tech.
ChEMBL_966751 (CHEMBL2400451)
IC50
>250000±n/a nM
Citation
 Ryu, SImai, YNOiki, S The synergic modeling for the binding of fluoroquinolone antibiotics to the hERG potassium channel. Bioorg Med Chem Lett 23:3848-51 (2013)  
Target
Name:
Potassium voltage-gated channel subfamily H member 2
Synonyms:
1,3-beta-glucan synthase component GLS2 ERG Eag-related protein 1 Ether-a-go-go-related gene (HERG) Ether-a-go-go-related gene potassium channel 1 Ether-a-go-go-related gene potassium channel 1 (hERG1) Ether-a-go-go-related protein 1 H-ERG KCNH2 Potassium voltage-gated channel subfamily H member 2 (hERG) Voltage-gated potassium channel subunit Kv11.1 hERG Potassium Channel 1 | putative potassium channel subunit
Type:
Multi-pass membrane protein
Mol. Mass.:
126672.65
Organism:
Homo sapiens (Human)
Description:
Q12809
Residue:
1159
  
Inhibitor
Name:
BDBM50366822
Synonyms:
AT-4140 SPARFLOXACIN | Spara
Type:
Small organic molecule
Emp. Form.:
C19H22F2N4O3
Mol. Mass.:
392.3998
SMILES:
C[C@H]1CN(C[C@@H](C)N1)c1c(F)c(N)c2c(c1F)n(cc(C(O)=O)c2=O)C1CC1
: