Target
Thromboxane A2 receptor
Ligand
BDBM50003795
Substrate
Meas. Tech.
ChEMBL_209593 (CHEMBL814728)
IC50
2100±n/a nM
Citation
 Cozzi, PGiordani, AMenichincheri, MPillan, APinciroli, VRossi, ATonani, RVolpi, DTamburin, MFerrario, R Agents combining thromboxane receptor antagonism with thromboxane synthase inhibition: [[[2-(1H-imidazol-1-yl)ethylidene]amino]oxy]alkanoic acids. J Med Chem 37:3588-604 (1994)  
Target
Name:
Thromboxane A2 receptor
Synonyms:
Prostanoid TP receptor TBXA2R Thromboxane Thromboxane Beta
Type:
Enyzme
Mol. Mass.:
37445.28
Organism:
Homo sapiens (Human)
Description:
P21731
Residue:
343
  
Inhibitor
Name:
BDBM50003795
Synonyms:
5-[1-Pyridin-3-yl-1-(3-trifluoromethyl-phenyl)-meth-(E)-ylideneaminooxy]-pentanoic acid CHEMBL280728 ridogrel
Type:
Small organic molecule
Emp. Form.:
C18H17F3N2O3
Mol. Mass.:
366.3344
SMILES:
OC(=O)CCCCO\N=C(\c1cccnc1)c1cccc(c1)C(F)(F)F
: