Target
Kappa-type opioid receptor
Ligand
BDBM50370595
Substrate
Meas. Tech.
ChEMBL_978258 (CHEMBL2423627)
EC50
16000±n/a nM
Citation
 Magnus, PGhavimi, BCoe, JW Access to 7?-analogs of codeine with mixed ?/? agonist activity via 6,7-?-epoxide opening. Bioorg Med Chem Lett 23:4870-4 (2013)  
Target
Name:
Kappa-type opioid receptor
Synonyms:
K-OR-1 Kappa-opioid receptor (KOR) Kappa-type opioid receptor (KOR) OPIATE Kappa OPRK1 kappa opioid receptor (KOR)
Type:
G Protein-Coupled Receptor (GPCR)
Mol. Mass.:
42648.76
Organism:
Homo sapiens (Human)
Description:
P41145
Residue:
380
  
Inhibitor
Name:
BDBM50370595
Synonyms:
OXYCODONE US1184575, oxycodone | US9233167, Oxycodone
Type:
Small organic molecule
Emp. Form.:
C18H21NO4
Mol. Mass.:
315.3636
SMILES:
COc1ccc2C[C@H]3N(C)CC[C@@]45[C@@H](Oc1c24)C(=O)CC[C@@]35O
: