Target
Metallo-beta-lactamase IMP-1
Ligand
BDBM50493096
Substrate
Meas. Tech.
ChEMBL_978383 (CHEMBL2424346)
IC50
25600±n/a nM
Citation
 Hiraiwa, YMorinaka, AFukushima, TKudo, T Metallo-?-lactamase inhibitory activity of 3-alkyloxy and 3-amino phthalic acid derivatives and their combination effect with carbapenem. Bioorg Med Chem 21:5841-50 (2013)  
Target
Name:
Metallo-beta-lactamase IMP-1
Synonyms:
Metallo beta-lactamase blaIMP-1
Type:
PROTEIN
Mol. Mass.:
14898.12
Organism:
Pseudomonas aeruginosa
Description:
ChEMBL_116913
Residue:
133
  
Inhibitor
Name:
BDBM50493096
Synonyms:
CHEMBL2420947
Type:
Small organic molecule
Emp. Form.:
C15H19NO5
Mol. Mass.:
293.3151
SMILES:
OCCC1CCN(CC1)c1cccc(C(O)=O)c1C(O)=O
: