Target
Beta-2 adrenergic receptor
Ligand
BDBM50029050
Substrate
Meas. Tech.
ChEMBL_982327 (CHEMBL2426847)
Kd
631±n/a nM
Citation
 Peterson, YKCameron, RBWills, LPTrager, RELindsey, CCBeeson, CCSchnellmann, RG ?2-Adrenoceptor agonists in the regulation of mitochondrial biogenesis. Bioorg Med Chem Lett 23:5376-81 (2013)  
Target
Name:
Beta-2 adrenergic receptor
Synonyms:
ADRB2 ADRB2_HUMAN Beta-2 adrenoceptor | Beta-2 adrenoreceptor
Type:
Mol. Mass.:
46461.69
Organism:
Homo sapiens (Human)
Description:
P07550
Residue:
413
  
Inhibitor
Name:
BDBM50029050
Synonyms:
(-)-(R)-epinephrine (-)-adrenaline (R)-adrenaline Adrenalin EPINEPHRINE levoepinephrine
Type:
Small organic molecule
Emp. Form.:
C9H13NO3
Mol. Mass.:
183.2044
SMILES:
CNC[C@H](O)c1ccc(O)c(O)c1
: