Target
Aromatase
Ligand
BDBM50025428
Substrate
Meas. Tech.
ChEMBL_50697 (CHEMBL663242)
IC50
300±n/a nM
Citation
 Numazawa, MMutsumi, ATachibana, MHoshi, K Synthesis of androst-5-en-7-ones and androsta-3,5-dien-7-ones and their related 7-deoxy analogs as conformational and catalytic probes for the active site of aromatase. J Med Chem 37:2198-205 (1994)  
Target
Name:
Aromatase
Synonyms:
ARO1 CP19A_HUMAN CYP19 CYPXIX Cytochrome P450 19A1 Cytochrome P450-C19 (CYP19) FL cytokine receptor precursor | P-450AROM
Type:
Enzyme
Mol. Mass.:
57888.92
Organism:
Homo sapiens (Human)
Description:
P11511
Residue:
503
  
Inhibitor
Name:
BDBM50025428
Synonyms:
10,13-Dimethyl-1,6,7,8,9,10,11,12,13,14,15,16-dodecahydro-2H-cyclopenta[a]phenanthrene-3,17-dione CHEMBL274826
Type:
Small organic molecule
Emp. Form.:
C19H26O2
Mol. Mass.:
286.4085
SMILES:
CC12CCC3C(CCC4=CC(=O)CCC34C)C1CCC2=O
: