Target
Sodium-dependent noradrenaline transporter
Ligand
BDBM77970
Substrate
Meas. Tech.
ChEMBL_983926 (CHEMBL2433695)
IC50
65±n/a nM
Citation
 Park, JESong, CChoi, KSim, TMoon, BRoh, EJ Synthesis and biological evaluation of novel 3,4-diaryl lactam derivatives as triple reuptake inhibitors. Bioorg Med Chem Lett 23:5515-8 (2013)  
Target
Name:
Sodium-dependent noradrenaline transporter
Synonyms:
Monoamine transporter NET Noradrenaline Transporter (NET) Norepinephrine transporter protein (NET) SLC6A2 Sodium-dependent noradrenaline transporter (NET) | Solute carrier family 6 member 2
Type:
Multi-pass membrane protein
Mol. Mass.:
69337.72
Organism:
Homo sapiens (Human)
Description:
P23975
Residue:
617
  
Inhibitor
Name:
BDBM77970
Synonyms:
3-(2-chloranyl-5,6-dihydrobenzo[b][1]benzazepin-11-yl)-N,N-dimethyl-propan-1-amine;hydrochloride 3-(2-chloro-5,6-dihydrobenzo[b][1]benzazepin-11-yl)-N,N-dimethylpropan-1-amine;hydrochloride CHLORIMIPRAMINE CLOMIPRAMINE HYDROCHLORIDE MLS000028511 cid_68539 | med.21724, Compound Clomipramine
Type:
Small organic molecule
Emp. Form.:
C19H23ClN2
Mol. Mass.:
314.852
SMILES:
CN(C)CCCN1c2ccccc2CCc2ccc(Cl)cc12
: