Target
Adenosine receptor A1
Ligand
BDBM50039697
Substrate
Meas. Tech.
ChEMBL_29600 (CHEMBL640258)
Kd
1.1±n/a nM
Citation
 Scammells, PJBaker, SPBelardinelli, LOlsson, RA Substituted 1,3-dipropylxanthines as irreversible antagonists of A1 adenosine receptors. J Med Chem 37:2704-12 (1994)  
Target
Name:
Adenosine receptor A1
Synonyms:
A1 adenosine receptor (hA1) AA1R_HUMAN ADORA1 Adenosine A1-receptor Adenosine receptor A1 (hA1) | Adenosine transporter (AdT)
Type:
G Protein-Coupled Receptor (GPCR)
Mol. Mass.:
36520.92
Organism:
Homo sapiens (Human)
Description:
P30542
Residue:
326
  
Inhibitor
Name:
BDBM50039697
Synonyms:
Bromo-acetic acid 2-(8-cyclopentyl-2,6-dioxo-1-propyl-1,2,6,7-tetrahydro-purin-3-yl)-1-methyl-ethyl ester | CHEMBL91604
Type:
Small organic molecule
Emp. Form.:
C18H25BrN4O4
Mol. Mass.:
441.319
SMILES:
CCCn1c(=O)n(CC(C)OC(=O)CBr)c2nc([nH]c2c1=O)C1CCCC1
: