Target
Angiotensin-converting enzyme
Ligand
BDBM50367879
Substrate
Meas. Tech.
ChEMBL_989623 (CHEMBL2445167)
IC50
0.100000±n/a nM
Citation
 Gomez, CBerteina-Raboin, SDe Nanteuil, GGuillaumet, G Perindopril and ramipril phosphonate analogues as a new class of angiotensin converting enzyme inhibitors. Bioorg Med Chem 21:7216-21 (2013)  
Target
Name:
Angiotensin-converting enzyme
Synonyms:
ACE Angiotensin converting enzyme (ACE) Angiotensin-converting enzyme, soluble form CD_antigen=CD143 DCP1 Kininase II
Type:
Enzyme
Mol. Mass.:
149709.01
Organism:
Homo sapiens (Human)
Description:
Residue:
1306
  
Inhibitor
Name:
BDBM50367879
Synonyms:
LISINOPRIL
Type:
Small organic molecule
Emp. Form.:
C21H31N3O5
Mol. Mass.:
405.4879
SMILES:
NCCCC[C@H](N[C@@H](CCc1ccccc1)C(O)=O)C(=O)N1CCC[C@H]1C(O)=O
: