Target
Matrix protein 2 [1-96]
Ligand
BDBM50033369
Substrate
Meas. Tech.
ChEMBL_1275615 (CHEMBL3090746)
IC50
199900±n/a nM
Citation
 Rey-Carrizo, MTorres, EMa, CBarniol-Xicota, MWang, JWu, YNaesens, LDeGrado, WFLamb, RAPinto, LHVázquez, S 3-Azatetracyclo[5.2.1.1(5,8).0(1,5)]undecane derivatives: from wild-type inhibitors of the M2 ion channel of influenza A virus to derivatives with potent activity against the V27A mutant. J Med Chem 56:9265-74 (2013)  
Target
Name:
Matrix protein 2 [1-96]
Synonyms:
M Matrix protein 2
Type:
PROTEIN
Mol. Mass.:
11051.96
Organism:
Influenza A virus
Description:
ChEMBL_1453980
Residue:
96
  
Inhibitor
Name:
BDBM50033369
Synonyms:
AMANTADINE SYMADINE | SYMMETREL
Type:
Small organic molecule
Emp. Form.:
C10H17N
Mol. Mass.:
151.2487
SMILES:
NC12CC3CC(CC(C3)C1)C2
: