Target
Adenosine receptor A2a
Ligand
BDBM10849
Substrate
Meas. Tech.
ChEMBL_1278720 (CHEMBL3096094)
Ki
23400±n/a nM
Citation
 Koch, PAkkari, RBrunschweiger, ABorrmann, TSchlenk, MKüppers, PKöse, MRadjainia, HHockemeyer, JDrabczy?ska, AKie?-Kononowicz, KMüller, CE 1,3-Dialkyl-substituted tetrahydropyrimido[1,2-f]purine-2,4-diones as multiple target drugs for the potential treatment of neurodegenerative diseases. Bioorg Med Chem 21:7435-52 (2013)  
Target
Name:
Adenosine receptor A2a
Synonyms:
A2A adenosine receptor (hA2A) ADENOSINE A2 ADORA2 Adenosine A2A receptor (A2AAR)
Type:
G Protein-Coupled Receptor (GPCR)
Mol. Mass.:
44716.46
Organism:
Homo sapiens (Human)
Description:
P29274
Residue:
412
  
Inhibitor
Name:
BDBM10849
Synonyms:
1,3,7-trimethyl-2,3,6,7-tetrahydro-1H-purine-2,6-dione CHEMBL113 caffeine
Type:
Small organic molecule
Emp. Form.:
C8H10N4O2
Mol. Mass.:
194.1906
SMILES:
Cn1cnc2n(C)c(=O)n(C)c(=O)c12
: