Target
Potassium voltage-gated channel subfamily H member 2
Ligand
BDBM50494716
Substrate
Meas. Tech.
ChEMBL_1278260 (CHEMBL3096732)
Ki
9.5±n/a nM
Citation
 Louvel, JCarvalho, JFYu, ZSoethoudt, MLenselink, EBKlaasse, EBrussee, JIjzerman, AP Removal of human ether-à-go-go related gene (hERG) K+ channel affinity through rigidity: a case of clofilium analogues. J Med Chem 56:9427-40 (2013)  
Target
Name:
Potassium voltage-gated channel subfamily H member 2
Synonyms:
1,3-beta-glucan synthase component GLS2 ERG Eag-related protein 1 Ether-a-go-go-related gene (HERG) Ether-a-go-go-related gene potassium channel 1 Ether-a-go-go-related gene potassium channel 1 (hERG1) Ether-a-go-go-related protein 1 H-ERG KCNH2 Potassium voltage-gated channel subfamily H member 2 (hERG) Voltage-gated potassium channel subunit Kv11.1 hERG Potassium Channel 1 | putative potassium channel subunit
Type:
Multi-pass membrane protein
Mol. Mass.:
126672.65
Organism:
Homo sapiens (Human)
Description:
Q12809
Residue:
1159
  
Inhibitor
Name:
BDBM50494716
Synonyms:
CHEMBL3093986
Type:
Small organic molecule
Emp. Form.:
C19H30ClN
Mol. Mass.:
307.901
SMILES:
CCCCCCCN(CC)C\C=C\Cc1ccc(Cl)cc1
: