Target
Mu-type opioid receptor
Ligand
BDBM50495227
Substrate
Meas. Tech.
ChEMBL_1283864 (CHEMBL3106315)
Ki
0.420000±n/a nM
Citation
 Bender, AMClark, MJAgius, MPTraynor, JRMosberg, HI Synthesis and evaluation of 4-substituted piperidines and piperazines as balanced affinity ? opioid receptor (MOR) agonist/? opioid receptor (DOR) antagonist ligands. Bioorg Med Chem Lett 24:548-51 (2014)  
Target
Name:
Mu-type opioid receptor
Synonyms:
MOR-1 Mu-type opioid receptor (MOR) OPRM_RAT Opioid receptor B Ror-b
Type:
G Protein-Coupled Receptor (GPCR)
Mol. Mass.:
44503.11
Organism:
Rattus norvegicus (rat)
Description:
Competition binding assays were carried out using membrane preparations from transfected HN9.10 cells that constitutively expressed the mu opioid receptor.
Residue:
398
  
Inhibitor
Name:
BDBM50495227
Synonyms:
CHEMBL3104103
Type:
Small organic molecule
Emp. Form.:
C26H37N3O2
Mol. Mass.:
423.5909
SMILES:
Cc1cc(O)cc(C)c1C[C@H](N)C(=O)N1CCN(CCCCCc2ccccc2)CC1
: