Target
Delta-type opioid receptor
Ligand
BDBM50495231
Substrate
Meas. Tech.
ChEMBL_1283865 (CHEMBL3106316)
Ki
36±n/a nM
Citation
 Bender, AMClark, MJAgius, MPTraynor, JRMosberg, HI Synthesis and evaluation of 4-substituted piperidines and piperazines as balanced affinity ? opioid receptor (MOR) agonist/? opioid receptor (DOR) antagonist ligands. Bioorg Med Chem Lett 24:548-51 (2014)  
Target
Name:
Delta-type opioid receptor
Synonyms:
Cytochrome P450 3A4 Delta opioid receptor Delta-type opioid receptor (DOR) OPRD_RAT Opioid receptor Opioid receptors; mu & delta Ror-a | Voltage-gated potassium channel
Type:
G Protein-Coupled Receptor (GPCR)
Mol. Mass.:
40465.04
Organism:
Rattus norvegicus (rat)
Description:
Competition binding assays were using CHO-K1 cell membranes expressing the opioid receptor.
Residue:
372
  
Inhibitor
Name:
BDBM50495231
Synonyms:
CHEMBL3104108
Type:
Small organic molecule
Emp. Form.:
C24H33N3O2
Mol. Mass.:
395.5377
SMILES:
Cc1cc(O)cc(C)c1C[C@H](N)C(=O)N1CCN(CCCc2ccccc2)CC1
: