Target
Hypoxia-inducible factor 1-alpha inhibitor
Ligand
BDBM50495468
Substrate
Meas. Tech.
ChEMBL_1287193 (CHEMBL3112250)
IC50
>100000±n/a nM
Citation
 Rotili, DTomassi, SConte, MBenedetti, RTortorici, MCiossani, GValente, SMarrocco, BLabella, DNovellino, EMattevi, AAltucci, LTumber, AYapp, CKing, ONHopkinson, RJKawamura, ASchofield, CJMai, A Pan-histone demethylase inhibitors simultaneously targeting Jumonji C and lysine-specific demethylases display high anticancer activities. J Med Chem 57:42-55 (2014)  
Target
Name:
Hypoxia-inducible factor 1-alpha inhibitor
Synonyms:
FIH1 HIF1N_HUMAN Hypoxia-inducible factor 1-alpha inhibitor
Type:
Enzyme
Mol. Mass.:
40278.92
Organism:
Homo sapiens (Human)
Description:
Q9NWT6
Residue:
349
  
Inhibitor
Name:
BDBM50495468
Synonyms:
CHEMBL3108958
Type:
Small organic molecule
Emp. Form.:
C23H19F3N4O5
Mol. Mass.:
488.416
SMILES:
OC(=O)C(F)(F)F.N[C@@H]1C[C@H]1c1ccc(NC(=O)c2ccnc(c2)-c2cc(ccn2)C(O)=O)cc1
: