Target
Lysine-specific demethylase 4E
Ligand
BDBM50495473
Substrate
Meas. Tech.
ChEMBL_1287196 (CHEMBL3112253)
IC50
5100±n/a nM
Citation
 Rotili, DTomassi, SConte, MBenedetti, RTortorici, MCiossani, GValente, SMarrocco, BLabella, DNovellino, EMattevi, AAltucci, LTumber, AYapp, CKing, ONHopkinson, RJKawamura, ASchofield, CJMai, A Pan-histone demethylase inhibitors simultaneously targeting Jumonji C and lysine-specific demethylases display high anticancer activities. J Med Chem 57:42-55 (2014)  
Target
Name:
Lysine-specific demethylase 4E
Synonyms:
2-OG-Dependent Histone Demethylase JMJD2E Jumonji domain-containing protein 2E (JMJD2E) KDM4DL KDM4E_HUMAN Lysine-specific demethylase 4E | Lysine-specific demethylase 4E (KDM4E)
Type:
Enzyme
Mol. Mass.:
56815.71
Organism:
Homo sapiens (Human)
Description:
B2RXH2
Residue:
506
  
Inhibitor
Name:
BDBM50495473
Synonyms:
CHEMBL3108955
Type:
Small organic molecule
Emp. Form.:
C25H29ClN4O3
Mol. Mass.:
468.976
SMILES:
Cl.N[C@H]1C[C@@H]1c1ccc(NC(=O)CCCCCNC(=O)c2ccc(O)c3ncccc23)cc1
: