Target
Dihydrofolate reductase
Ligand
BDBM50043393
Substrate
Meas. Tech.
ChEMBL_52837 (CHEMBL665042)
IC50
0.00053±n/a nM
Citation
 Piper, JRJohnson, CAMaddry, JAMalik, NDMcGuire, JJOtter, GMSirotnak, FM Studies on analogues of classical antifolates bearing the naphthoyl group in place of benzoyl in the side chain. J Med Chem 36:4161-71 (1994)  
Target
Name:
Dihydrofolate reductase
Synonyms:
DYR_PNECA Dihydrofolate reductase Tetrahydrofolate dehydrogenase
Type:
Enzyme
Mol. Mass.:
23891.29
Organism:
Pneumocystis carinii
Description:
Residue:
206
  
Inhibitor
Name:
BDBM50043393
Synonyms:
2-({4-[(2,4-Diamino-pyrido[2,3-d]pyrimidin-6-ylmethyl)-amino]-naphthalene-1-carbonyl}-amino)-pentanedioic acid | CHEMBL132142
Type:
Small organic molecule
Emp. Form.:
C24H23N7O5
Mol. Mass.:
489.4833
SMILES:
Nc1nc(N)c2cc(CNc3ccc(C(=O)NC(CCC(O)=O)C(O)=O)c4ccccc34)cnc2n1
: