Target
Integrase
Ligand
BDBM50496325
Substrate
Meas. Tech.
ChEMBL_1297949 (CHEMBL3132334)
IC50
14±n/a nM
Citation
 Zhao, XZSmith, SJMétifiot, MJohnson, BCMarchand, CPommier, YHughes, SHBurke, TR Bicyclic 1-hydroxy-2-oxo-1,2-dihydropyridine-3-carboxamide-containing HIV-1 integrase inhibitors having high antiviral potency against cells harboring raltegravir-resistant integrase mutants. J Med Chem 57:1573-82 (2014)  
Target
Name:
Integrase
Synonyms:
pol
Type:
PROTEIN
Mol. Mass.:
32203.43
Organism:
Human immunodeficiency virus 1
Description:
ChEMBL_106649
Residue:
288
  
Inhibitor
Name:
BDBM50496325
Synonyms:
CHEMBL3125979
Type:
Small organic molecule
Emp. Form.:
C16H11ClFN3O3
Mol. Mass.:
347.728
SMILES:
On1c2ncccc2cc(C(=O)NCc2ccc(F)c(Cl)c2)c1=O
: